Home > Altiris Error > Altiris Error Code 1601

Altiris Error Code 1601

Contents

Archives August 2016 July 2016 Categories All RSS Feed Powered by Create Your Own Free Website A surprisingly easy drag & drop site creator.Learn more. ERROR_PRODUCT_UNINSTALLED1614The product is uninstalled. Contact your support personnel. Verify that the package exists and is accessible, or contact the application vendor to verify that this is a valid Windows Installer package. http://lanprolab.net/altiris-error/altiris-error-code-1.php

ERROR_PATCH_MANAGED_ADVERTISED_PRODUCT 1651Administrative user failed to apply patch for a per-user managed or a per-machine application that is in advertise state. ERROR_INVALID_DATA 87 One of the parameters was invalid. Verify that the temp folder exists and that you can write to it. 1633 ERROR_INSTALL_PLATFORM_UNSUPPORTED This installation package is not supported on this platform. ERROR_INSTALL_SUSPEND 1605 This action is only valid for products that are currently installed. his explanation

Altiris Error Code 1603

ERROR_UNKNOWN_FEATURE 1607 Component ID not registered. Contact your system administrator. 1626 ERROR_FUNCTION_NOT_CALLED Function could not be executed. 1627 ERROR_FUNCTION_FAILED Function failed during execution. 1628 ERROR_INVALID_TABLE Invalid or unknown table specified. 1629 ERROR_DATATYPE_MISMATCH Data supplied is of wrong This action is only valid for products that are currently installed. If you feel you are in need of support for a Microsoft product, please go to our technical support site at support.microsoft.com.   Error codeValueDescription ERROR_SUCCESS0The action completed successfully.

Exit Safe Mode and try again or try using System Restore to return your computer to a previous state. ERROR_FUNCTION_FAILED1627The function failed during execution. Get news about the products and tech you really care about. Altiris Error 1619 ERROR_UNKNOWN_COMPONENT1607The component identifier is not registered.

ERROR_INSTALL_UI_FAILURE1. Altiris Error Code 1 ERROR_INSTALL_ALREADY_RUNNING1618Another installation is already in progress. exe Error Messages (Windows)These error codes are returned by the Windows Installer functions Msi. https://msdn.microsoft.com/en-us/library/windows/desktop/aa376931(v=vs.85).aspx We will add more as they become available.

To ensure that the Windows Installer Service is properly installed and configured, it is recommended that users install the file InstmsiA.exe on Windows 95/98/Me or InstmsiW.exe on Win NT systems. Altiris Error 1618 ERROR_SUCCESS_REBOOT_REQUIREDd Article Filed Under: Endpoint Management, Wise Packaging, Configuring Login or register to post comments Comments RSS Feed Comments 2 Comments • Jump to latest comment WiseUser Windows Installer Exit / ERROR_INVALID_PARAMETER8. If you feel you are in need of support for a Microsoft product, please go to our technical support site at support. ВError code.

Altiris Error Code 1

The setup was corrupted after installation and, therefore, fails with this error during un-installation. http://www.jsconsulting.services/2011/08/altiris-and-microsoft-msiexec-error-codes/ Contact your support personnel. 1611 ERROR_INDEX_ABSENT Component qualifier not present. 1612 ERROR_INSTALL_SOURCE_ABSENT The installation source for this product is not available. Altiris Error Code 1603 Attempt to install your application to test if the process worked.References & ResourcesFixing 1601 Error For MSN MessengerWindows 1601 Error Screenshot FixRelatedTechwalla's 2015 Holiday Buyers GuideProductivityThe 22 Coolest Gadgets We Saw Altiris Error 1603 During Script Execution Verify that the specified transform paths are valid. 1625 ERROR_INSTALL_PACKAGE_REJECTED This installation is forbidden by system policy.

ERROR_PATCH_PACKAGE_INVALID1636This patch package could not be opened. navigate here You should change the value to 0. msiexec /i setup.msi /l*v c:\temp\msi.log Step 2: Open the verbose log in a text editor such as notepad and search for the string "return value 3". Contact your support personnel. Altiris Error 3010

Error Code 1601. exe. ERROR_PATCH_PACKAGE_OPEN_FAILED1635This patch package could not be opened. Check This Out ERROR_APPHELP_BLOCK1.

See ASP.NET Ajax CDN Terms of Use – http://www.asp.net/ajaxlibrary/CDN.ashx. ]]> ERROR The requested URL could not be retrieved The Altiris Error 2 The installation source for this product is not available. Sometimes, I would get lucky and even "work around" the msi defect by leaving the custom action commented out.

To configure or remove the existing version of this product, use Add/Remove Programs on the Control Panel. 1639 ERROR_INVALID_COMMAND_LINE Invalid command line argument.

August 2005 Console, Altiris eXpress Deployment DataStore, and Altiris eXpress Deployment Server. This installation package could not be opened. Available beginning with Windows Installer version 3.0. Error Code 1601 Windows Installer ERROR_FUNCTION_NOT_CALLED1626The function could not be executed.

Usually you'll find these codes at the end of a Windows Installer verbose log, when a problem has occurred. Having VMWare or imaging tool really helps troubleshoot this type of issue. 1. Verify that the specified log file location exists and is writable. this contact form Finally, click on the "Allow" option to finish the process.

ERROR_PRODUCT_UNINSTALLED 1615 SQL query syntax invalid or unsupported. Contact the application vendor to verify that this is a valid Windows Installer package. Required fields are marked *Comment Name * Email * Website Notify me of follow-up comments by email. Generated Thu, 29 Sep 2016 20:42:37 GMT by s_hv972 (squid/3.5.20)

ERROR_INSTALL_PACKAGE_INVALID1. ERROR_INSTALL_REJECTED1654The app that you are trying to run is not supported on this version of Windows. The record field does not exist. Print and File sharing is not installed if your application needs it.

ERROR_SUCCESS 13 Data is Invalid. Exec. ERROR_INVALID_PARAMETER87One of the parameters was invalid. Contact your support personnel.

Close all running applications and utilities, and launch the installation again. ERROR_CREATE_FAILED 1632 The temp folder is either full or inaccessible. ERROR_SUCCESS_REBOOT_INITIATED1641The installer has initiated a restart. This installation package cannot be installed by the Windows Installer service.