Home > An Error > An Error Has Occurred While Processing The Maven Artifact Tasks

An Error Has Occurred While Processing The Maven Artifact Tasks

The error i get is: [artifact:dependencies] An error has occurred while processing the Maven artifact tasks. [artifact:dependencies] Diagnosis: [artifact:dependencies] [artifact:dependencies] Unable to resolve artifact: Missing: [artifact:dependencies] ---------- [artifact:dependencies] 1) xxx.yyy:zzz:jar:0.0.2 The Religious supervisor wants to thank god in the acknowledgements more hot questions question feed lang-xml about us tour help blog chat data legal privacy policy work here advertising info mobile contact http://www.sonatype.com/people/2010/11/what-to-do-when-nexus-returns-401/ Hide Permalink Serban Iordache added a comment - 12/28/12 09:36 PM Thanks, Joel! Please note that I had to move several taskdefs from build-common.xml to build.xml in order to avoid OOM errors. navigate here

So enter maven-ant-tasks... share|improve this answer answered Sep 24 '14 at 18:12 Kevin 148111 Where can I get the 2.1.4-SNAPSHOT version? Personal Open source Business Explore Sign up Sign in Pricing Blog Support Search GitHub This repository Watch 70 Star 109 Fork 607 BroadleafCommerce/DemoSite Code Issues 33 Pull requests 4 Projects 0 I'm going to try under Linux later today. check it out

Since these changes, the only full build that has completed is the Lucene-3.x build, and it was a success. Why don't most major game engines use gifs for animated textures? 100 Prisoners and a clock Plural of "State of the Union" When people brag about their abilities and belittle their BUILD FAILED Total time: 38.061 secs ~/workspaces/t5 $ I can't find any details on apache.org or sonatype.com about the upgrade; i.e., what I need to change in my build/configuration to continue Join them; it only takes a minute: Sign up Maven ant tasks deploying to public nexus repository instead of the url specified up vote 4 down vote favorite 1 I am

Eventually these class definitions fill up the PermGen space and cause an OOM error. Are we seeing everything slowly? Lewis Ship added a comment - 13/Sep/14 00:02 This is resolved for me as well. It turned out that it was a problem with my gradle settings.

Linked ApplicationsLoading… DashboardsProjectsIssues Help Online Help Keyboard Shortcuts About JIRA JIRA Credits Log In To raise new issues or bugs against Gradle, please use discuss.gradle.org. Everything works fine now. With this patch in place I verified that I am able to publish to the snapshot and staging repositories as follows: % ant maven-build -Dmvn.publish.repo=snapshots % ant maven-publish -Dmvn.publish.repo=snaphots % ant http://stackoverflow.com/questions/13825701/maven-ant-tasks-deploying-to-public-nexus-repository-instead-of-the-url-specifie Show Steve Rowe added a comment - 21/Jan/11 06:11 I tested ant clean generate-maven-artifacts on branch_3x with maven-ant-tasks-2.1.1.jar and both Ant 1.7.1 and 1.8.1.

Export Tools GradleGRADLE-2254Maven Plugin uploads certain artifacts twiceLog In ExportXMLWordPrintable Details Type: Bug Status: Resolved Resolution: Fixed Affects Version/s: None Fix Version/s: 1.1-rc-1 Gradle Forums topic Reference: problem - Maven Plugin Hide Permalink [email protected] added a comment - 03/Oct/11 20:58 ----------------------------------------------------------- This is an automatically generated e-mail. FWIW, I was able to fetch 2.0.9 from the archive: http://archive.apache.org/dist/maven/binaries/maven-ant-tasks-2.0.9.jar Thanks for the detailed explanation Uwe. Summary ------- Fix for HIVE-2243.

asked 4 years ago viewed 264 times active 4 years ago Related 497How do I tell Maven to use the latest version of a dependency?36Maven or Ivy for Managing Dependencies from https://issues.gradle.org/browse/GRADLE-2254 I have a fix for this issue on my machine, but not yet committed it, since I have not yet created a unit test for this. A post mortem email is pending in the morning for details. Browse other questions tagged ant maven-2 or ask your own question.

http://www.sonatype.com/people/2010/11/what-to-do-when-nexus-returns-401/ Show Joel Orlina added a comment - 12/28/12 03:43 PM I confess I haven't had much experience troubleshooting gradle issues. http://lanprolab.net/an-error/an-error-occurred-while-processing-this-directive-help.php HTH Show Ian Boston added a comment - 30/Nov/10 17:43 I am sure you know this, but, this patch fixes an otherwise broken build of Solr and Lucene at r1040465 using Thanks, Carl Hide Permalink Carl Steinbach added a comment - 07/Oct/11 08:17 I commented out the body of the 'test' target in build-common.xml and then verified that the OOM error still Verified that the jar, package, and test targets still work.

Show John Sichi added a comment - 10/Oct/11 20:00 Committed to trunk and 0.8. maven-publish-artifact: [artifact:install-provider] Installing provider: org.apache.maven.wagon:wagon-http:jar:1.0-beta-2:runtime [artifact:deploy] Deploying to https://repository.apache.org/content/repositories/staging [artifact:deploy] Uploading: org/apache/hive/hive-anttasks/0.8.0/hive-anttasks-0.8.0.jar to repository apache.staging.https at https://repository.apache.org/content/repositories/staging [artifact:deploy] Transferring 9K from apache.staging.https [artifact:deploy] An error has occurred while processing the Maven Hide Permalink Steve Rowe added a comment - 21/Jan/11 22:17 It appears that there were two problems blocking the Hudson build scripts from succeeding: Maven Ant Tasks seems to dislike mixed his comment is here Verified that the jar, package, and test targets still work.

Perhaps Maven is configured not to pick up jars from your Artifactory repository –Mark O'Connor May 15 '12 at 23:34 That looks like using the wrong GAV coordinates. –khmarbaise I think instead of adding stuff to the *build.xml files, we should require maven-ant-tasks-2.1.1.jar for execution of ant generate-maven-artifacts. Show Drew Farris added a comment - 23/Nov/10 02:33 Hi Steve, Uwe, I was using Ant 1.7.1 with 1.6.0_22, maven-ant-tasks 2.2.1 on ubuntu 10.04 - after switching to maven-ant-tasks 2.0.9 the

I'll test more combinations tomorrow.

Add library to local repo with new version Get dependencies for project, including new library version <--- this works Delete local .m2 repository cache. Tried this morning and it worked. Hide Permalink Carl Steinbach added a comment - 28/Jul/11 17:54 Sounds good. Hide Permalink Giridharan Kesavan added a comment - 29/Jul/11 17:02 can someone try the following command with credentials in the .m2/settings.xml and post the output? ( I don't have repo access

Return code is: 401 FAILURE: Build failed with an exception. Can't publish maven release artifacts to apache repository (Carl Steinbach via jvs) jvs : http://svn.apache.org/viewcvs.cgi/?root=Apache-SVN&view=rev&rev=1181189 Files : /hive/branches/branch-0.8/ant/build.xml /hive/branches/branch-0.8/build-common.xml /hive/branches/branch-0.8/build.xml /hive/branches/branch-0.8/cli/build.xml /hive/branches/branch-0.8/common/build.xml /hive/branches/branch-0.8/contrib/build.xml /hive/branches/branch-0.8/hbase-handler/build.xml /hive/branches/branch-0.8/hwi/build.xml /hive/branches/branch-0.8/jdbc/build.xml /hive/branches/branch-0.8/metastore/build.xml /hive/branches/branch-0.8/odbc/build.xml /hive/branches/branch-0.8/pdk/build.xml /hive/branches/branch-0.8/ql/build.xml /hive/branches/branch-0.8/serde/build.xml Everything works. weblink In fact, i need to either delete the version or create a new version to be able to download it again (and that would only work 1x).

So either I'm doing something wrong (which might very well be ) or this might be a bug. However, purging the local maven repository (~/.m2/repository/) and upgrading to maven-ant-tasks-2.1.1.jar allows ant generate-maven-artifacts to consistently succeed. Do you have ANT_OPTS or JAVA_OPTS set? Show John Sichi added a comment - 04/Oct/11 00:28 +1.

But I'm working on fixes to resolve our build so it works fine on 1.7 and 1.8. Show Brian Fox added a comment - 10/Sep/14 22:54 There's no upgrade that has taken place. I'm going to try under Linux later today. Verified that the jar, package, and test targets still work.

To reply, visit: https://reviews.apache.org/r/2153/ ----------------------------------------------------------- Review request for hive and John Sichi. Can Customs make me go back to return my electronic equipment or is it a scam? After switching to Ant 1.7.1 and maven-ant-tasks 2.0.9, both trunk and branch_3x now work for me too under Cygwin on Win7 without the proposed patch. (I put maven-ant-tasks-2.0.9.jar in C:\Users\sarowe\.ant\lib, rather Hide Permalink John Sichi added a comment - 10/Oct/11 20:00 Committed to trunk and 0.8.

Charging the company I work for to rent from myself Why don't we see faster 7400 series chips? FAILURE: Build failed with an exception. * What went wrong: Execution failed for task ':plastic:uploadPublished'. > Could not publish configuration 'published' > Error deploying artifact 'org.apache.tapestry:plastic:jar': Error deploying artifact: Authorization failed: we can delete them post publishing.. Show Serban Iordache added a comment - 12/28/12 09:36 PM Thanks, Joel!

Show Drew Farris added a comment - 21/Nov/10 20:11 Attached a trivial patch that applies cleanly against both the 3.x branch and trunk. This addresses bug HIVE-2243. This addresses bug HIVE-2243 . Do you have the same problem when deploying a release version?

How do I directly display a man page? Are there any Postbuses left in the UK? FWIW, I was able to fetch 2.0.9 from the archive: http://archive.apache.org/dist/maven/binaries/maven-ant-tasks-2.0.9.jar Thanks for the detailed explanation Uwe.