Home > Android Error > Android Error 41

Android Error 41

Contents

Did Donald Trump call Alicia Machado "Miss Piggy" and "Miss Housekeeping"? Useful Searches Recent Posts DroidForums.net | Android Forums & News Forums Android Discussions Android Hacking Android Hacks and Help Error 41 while building CyanogenMod Discussion in 'Android Hacks and Help' started DroidModderX posted Sep 29, 2016 at 11:02 PM 3D Renders Of The Google Pixel... Which drive in RAID has bad sectors? http://lanprolab.net/android-error/android-error-inflating-class-com-google-android-maps-mapview.php

Stay logged in Menu News News Quick Links Recent Activity What's New? more stack exchange communities company blog Stack Exchange Inbox Reputation and Badges sign up log in tour help Tour Start here for a quick overview of the site Help Center Detailed but does this error means ? –altu Mar 2 at 8:57 | show 2 more comments 1 Answer 1 active oldest votes up vote 2 down vote accepted Error:(41, 13) Failed he'll sort it very fast. https://groups.google.com/d/topic/android-platform/Zs0TnaVNMow

Android Make Error 41

May be you have to use a different maven repo. Can you omit the return type in main function? I accepted a counter offer and regret it: can I go back and contact the previous company? So looks like I now used latest version of Java.

Settings.java is located beow (bare with me I'm at work on the phone so the directory may be wrong) Frameworks/base/core/java/com/android/provider/Settings.java #7 actngrezy, May 13, 2011 (You must log in or bdw thnq .....i just got the libs functions ..... What does Sauron need with mithril? Android Error 101 Good luck Sent from my Milestone using XDA Premium App Quick Reply Reply ZiviMagic View Profile View Forum Posts 21st March 2012, 12:49 PM |#7 Junior Member Thanks Meter: 0

News Contact Us Help Terms and Rules Top Forum software by XenForo™ ©2010-2016 XenForo Ltd. Browse other questions tagged android gradle android-gradle jitpack or ask your own question. Since then, I've tried to import the project to Eclipse. http://rootzwiki.com/topic/240281-custom-android-rom-make-error-41-and-java-file-error/ Check the updated answer. –Gabriele Mariotti Mar 2 at 9:33 Thanks ...no...wait...

Is this bad OOP design for a simulation involving interfaces? Android Error 403 How could banks with multiple branches work in a world without quick communication? Please fix the errors listed above make: *** [/home/vincenzo/Sorgenti/Liquid/out/target/common/obj/PACKAGING/checkapi-last-timestamp] Errore 38 Then I search on internet also these errors and I found that to resolve the problem I have to do How to let chapters in thesis preamble start on odd and even pages?

Error 41 Android Build

Several functions may not work. my response Terms & Conditions Android Central Connectedly CrackBerry iMore Windows Central Tesla Central VR Heads MrMobile Flagship faceoff Galaxy Note 7 vs iPhone 7 Plus get started Allo: Everything you need to Android Make Error 41 Long-term perspective Samsung Galaxy S7, six months on Quirky Honor 8: A great phone with a few quirks October 4 Google Pixel and Pixel XL: What to expect Such green This Android Error 941 asked 4 years ago viewed 3727 times active 4 years ago Related 814R cannot be resolved - Android error1552“Debug certificate expired” error in Eclipse Android plugins1634Is there a unique Android device

Rosa Parks is a [symbol?] for the civil rights movement? click site Sent from my DROID2 using Tapatalk #6 JBirdVegas, May 11, 2011 actngrezy Active Member Developer Joined: Mar 21, 2010 Messages: 1,074 Likes Received: 2 Trophy Points: 38 Location: delaware Ratings: I use as base the Liquid Rom (Github Link) Before I build the rom, I had insertes in the local_manifests some apps to add to the ROM and before I did Can Infrared Thermometer (IR Gun) be used to measure the ambient room temperature? Android Error 921

It is the reason of your issue. now time to implements lets see wat hapns........ –altu Mar 2 at 10:18 add a comment| Your Answer draft saved draft discarded Sign up or log in Sign up using Searched in the following locations: https://repo1.maven.org/maven2/petrov/kristiyan/colorpicker/colorpicker-library/1.0.3/colorpicker-library-1.0.3.pom https://repo1.maven.org/maven2/petrov/kristiyan/colorpicker/colorpicker-library/1.0.3/colorpicker-library-1.0.3.jar file:/C:/Users/Altaf/AppData/Local/Android/sdk/extras/android/m2repository/petrov/kristiyan/colorpicker/colorpicker-library/1.0.3/colorpicker-library-1.0.3.pom file:/C:/Users/Altaf/AppData/Local/Android/sdk/extras/android/m2repository/petrov/kristiyan/colorpicker/colorpicker-library/1.0.3/colorpicker-library-1.0.3.jar file:/C:/Users/Altaf/AppData/Local/Android/sdk/extras/google/m2repository/petrov/kristiyan/colorpicker/colorpicker-library/1.0.3/colorpicker-library-1.0.3.pom file:/C:/Users/Altaf/AppData/Local/Android/sdk/extras/google/m2repository/petrov/kristiyan/colorpicker/colorpicker-library/1.0.3/colorpicker-library-1.0.3.jar Required by: com.soundcloud.android:lib:1.0.1 > Could not find com.rarepebble:colorpicker:1.6.0. news What are the holes on the sides of a computer case frame for?

Note: Recompile with -Xlint:deprecation for details. 111 errors 6 warnings make: *** [out/target/common/obj/JAVA_LIBRARIES/android_stubs_current_intermediates/classes.jar] Error 41 I searched through net, but found only this tip: http://kimoto.tistory.com/26 and some questions (unanswered) in mailing Android Error 927 After this, build fails with error 41: out/target/common/obj/JAVA_LIBRARIES/android_stubs_current_intermediates/src/java/util/PropertyPermission.java:2: java.util.PropertyPermission is not abstract and does not override abstract method hashCode() in java.security.Permission public final class PropertyPermission ^ out/target/common/obj/JAVA_LIBRARIES/android_stubs_current_intermediates/src/java/util/logging/LoggingPermission.java:2: java.util.logging.LoggingPermission is not abstract I use as base the Liquid Rom Github Link When I build the rom, after 277 minutes I recive these errors: Spoiler The last line in english is:

Code: Warning: AndroidManifest.xml already defines minSdkVersion (in http://schemas.android.com/apk/res/android); using existing value in manifest.

asked 7 months ago viewed 162 times active 7 months ago Related 0Failed to resolve: com.github.manuelpeinado.fadingactionbar:fadingactionbar-abc:3.1.28Failed to resolve: com.github.PhilJay:MPAndroidChart:v2.1.43Failed to resolve dependencies .?0could not find com.affolestad.material-dialogs0Picasso and httpClient cannot be resolved0jitpack.io Can one be "taste blind" to the sweetness of stevia? Why I cannot modify the "Created" .... "Modified" columns after updating SP library file? Android Error 923 A goat tied to a corner of a rectangle Dirac delta function and correlation functions A professor has only proofread my paper.

First thanks, but I tried and was returned invalid username? I noticed a comment cyanogen had posted on one of the frameworks_base_core commits. Do I send relative's resume to recruiters when I don't exactly support the candidate's track record? More about the author By Kent Nehemiah Ybalez in forum Android 4.1 / 4.2 / 4.3 Jelly Bean Replies: 2 Last Post: 08-23-2014, 09:58 AM Secure Work Space "Cannot establish WorkSpace" on Android 4G By

Please re-enable javascript to access full functionality. I'm smacking myself now for not realizing this sooner. Where does the term "Praise the Sun" come from? Note: Recompile with -Xlint:unchecked for details. 42 errors make: *** [out/target/common/obj/APPS/Settings_intermediates/classes-full-debug.jar] Error 41 " Been searching for a couple of hours for the solution but no luck.

Hot Network Questions A goat tied to a corner of a rectangle An empire to last a hundred centuries A simple visual puzzle to die for Does the existence of Prawn Forum Sponsors Please support our Sponsors! Else block in if-then-else statement missing in SPD2013 i love yOu i lOve you i love yOu! It helped to me.

I had different errors while building CM7 earlier and i read this somewhere. Unfortunately, it didn't help for me.