Home > App Error > App Error 104 Uncaught Classcastexception

App Error 104 Uncaught Classcastexception

Minor improvement reported by Siddharth Seth and fixed by Jian He (scheduler) Excessive logging in RM Mostly in the CS I believe {code} INFO org.apache.hadoop.yarn.server.resourcemanager.scheduler.SchedulerApplicationAttempt: Application application_1395435468498_0011 reserved container container_1395435468498_0011_01_000213 on stackoverflow.com/questions/how-to-ask –Matt Ball Jan 25 '11 at 13:15 next time i will put a code snippet when i ask question..thanks. The tests in {{TestProcfsBasedProcessTree}} only make sense on Linux, where the process tree calculations are based on reading the /proc file system. Default Messaging Component PM36685 Sensitive information logged by SIB exception when dumping SibRaRecoverableSiXaResource object PM38708 CWSJN5006E: error in NotificationMessageHolderTypeBinder PM39049 CWSID0029E message when service integration bus messaging engine fails over after http://lanprolab.net/app-error/app-error-104-uncaught-nullpointerexception-blackberry.php

YARN-1701. package com.example.tabssample; import android.app.Activity; import android.content.Intent; import android.os.Bundle; import android.view.View; import android.widget.Button; import android.widget.TextView; public class HomeActivity extends Activity { public void onCreate(Bundle savedInstanceState) { super.onCreate(savedInstanceState); TextView textview = new TextView(this); the log, application produce is: I 04/26/2011 03:36:33:634 d659800 APP| init_app I 04/26/2011 03:36:33:714 d659800 RhoSupport| require_compiled: application I 04/26/2011 03:36:33:794 d659800 APP| Current locale: en I 04/26/2011 03:36:33:884 d704000 APP| PM39908 The addGlobalListener API is not available with V6.1 Feature Packs PM44112 ServletOutputStream print method gets into infinite loop if the response buffer is set to a zero value System Management/Repository check my blog

Blocker bug reported by Mit Desai and fixed by Mit Desai Javascript injection on the job status page Scripts can be injected into the job status page as the diagnostics field PM29586 CSCP0007E ActivityPendingException PM30207 Activity service throws ActivityPendingException after receiving SAXParseException while processing a web service response. Misha van Tol Ranch Hand Posts: 56 I like... This patch will make it consistent.

Good luck. Major bug reported by Venkat Ranganathan and fixed by Junping Du (resourcemanager) Yarn getApplicationRequest start time range is not honored When we query for the previous applications by creating an instance PM56886 Determining if an object exists in replication can be slow DB Connections/ Connection Pooling PM59995 Applications using the Oracle11gDatastoreHelper gets ojdbc5.jar must be used when configuring to run with 11g Contact Us Use the form below to contact us!

PM88789 "Commit in subordinate" error when using enableInProcessConnections = true PM93761 Add the ability to persist the connection on most return codes JSP PM85512 The JSP compilation is generating a java.lang.ArrayIndexOutOfBoundsException Why is this compiled function 50x slower? Whatever string you set there will show up to the jobs page as it is ... my response com.sun.jersey.api.client.ClientHandlerException: java.net.ConnectException: Connection refused at com.sun.jersey.client.urlconnection.URLConnectionClientHandler.handle(URLConnectionClientHandler.java:149) at com.sun.jersey.api.client.Client.handle(Client.java:648) at com.sun.jersey.api.client.WebResource.handle(WebResource.java:670) at com.sun.jersey.api.client.WebResource.access$200(WebResource.java:74) at com.sun.jersey.api.client.WebResource$Builder.post(WebResource.java:563) at org.apache.hadoop.yarn.client.api.impl.TimelineClientImpl.doPostingEntities(TimelineClientImpl.java:131) at org.apache.hadoop.yarn.client.api.impl.TimelineClientImpl.putEntities(TimelineClientImpl.java:104) at org.apache.hadoop.yarn.applications.distributedshell.ApplicationMaster.publishApplicationAttemptEvent(ApplicationMaster.java:1072) at org.apache.hadoop.yarn.applications.distributedshell.ApplicationMaster.run(ApplicationMaster.java:515) at org.apache.hadoop.yarn.applications.distributedshell.ApplicationMaster.main(ApplicationMaster.java:281) Caused by: java.net.ConnectException: Connection refused at java.net.PlainSocketImpl.socketConnect(Native

PM31195 Allow a JAX-RPC one-way service to send back a 202 http status code. You signed out in another tab or window. Web Services (for example: SOAP or UDDI or WSGW or WSIF) PM37820 Webservice-calls result in NullPointerException after PM19534 PM38181 WSWS3163E error: is still received after applying PM27844 PM40861 It will take java.lang.NullPointerException: null at org.apache.hadoop.yarn.server.resourcemanager.TestAMAuthorization.testUnauthorizedAccess(TestAMAuthorization.java:284) Results : Tests in error: TestAMAuthorization.testUnauthorizedAccess:284 NullPointer TestAMAuthorization.testUnauthorizedAccess:284 NullPointer Tests run: 4, Failures: 0, Errors: 2, Skipped: 0 {code} MAPREDUCE-5843.

PM42874 When the ObjectClass is not defined the wimconfig file is overwritten PM43353 Users defined in the BPM custom registry failed to show up in a search using VMM API via http://www.rezider.com/questions/748960/blackberry-error HDFS-6234. What changes have you made? Critical bug reported by Ming Ma and fixed by Ming Ma Killing Task might cause the job to go to ERROR state MAPREDUCE-5833.

PM24920 Diagnostic trace service "enable log" check box display is incorrect PM25744 The "new" button does not appear on some transport chain administrative console pages when the page is first loaded. PM43657 VMM ignores default boolean values while making an API call. PM33076 VMM throws NoSuchAttributeException while searching PM33488 NullPointerException thrown on trying to update multi valued attributes in Property Extension repository PM34097 Exception message for invalid user name not propogated from VMM PM26816 The com.ibm.ws.scripting.JythonUtilities is incorrectly using the StringTokenizer constructors Data Replication Services PM29893 DRS instances fail to initialize during a ripple start of the cluster.

will look at it asap :) DineshShende commented Nov 4, 2015 @jdubois No issues with Maven.It works fine JHipster member atomfrede commented Nov 5, 2015 @DineshShende Which version are you using? My home country claims I am a dual national of another country, the country in question does not. Sorry for getting back so late....i agree that the problem first occurred when i tried to typecast an instance of java.util.Enumeration to BBPlatformContact type. Steven Kader at JaredCoFollow me on Twitter|Mipixi.com:Web App for Photo Sharing Report Inappropriate Content Message 7 of 9 (3,008 Views) Reply 0 Likes Sakberry Developer Posts: 248 Registered: ‎11-23-2009 My Device:

System Management/Repository PM42533 AdminApp.isAppRead returns "true" even when the expansion really fails. Default Messaging Component PK91232 . Hardik Trivedi Ranch Hand Posts: 252 posted 5 years ago I dont know that whether you have resolved the issue or not.

You can close this issue.

  • asked 5 years ago viewed 415 times active 5 years ago Get the weekly newsletter!
  • Fun fact, in build.gradle when searching for jetty: testCompile group: 'org.springframework.boot', name: 'spring-boot-starter-jetty' ...
  • Right now, not all of the individual tests are skipped when the OS is not Linux.
  • Thanks Saket Report Inappropriate Content Message 8 of 9 (3,005 Views) Reply 0 Likes StevenKader Developer Posts: 656 Registered: ‎02-03-2010 My Device: Z10 LE My Carrier: Rogers Re: BBM sim2 giving
  • PM27417 CWSCT0334E: Failed to deserialize replication.
  • Data Replication Services PM55377 Hang in com.ibm.ws.drs.managers.DRSBuddyManager during Application Server restart PM56317 DRS unnecessarily maintains WLM cluster information for the dynamic cache DRS instances.
  • Major bug reported by Varun Vasudev and fixed by Varun Vasudev Test TestFSDownload.testDownloadPublicWithStatCache fails on Windows The TestFSDownload.testDownloadPublicWithStatCache test in hadoop-yarn-common consistently fails on Windows environments.
  • Dead lock detected in RM when automatic failover is enabled. {noformat} Found one Java-level deadlock: ============================= "Thread-2": waiting to lock monitor 0x00007fb514303cf0 (object 0x00000000ef153fd0, a org.apache.hadoop.ha.ActiveStandbyElector), which is held by "main-EventThread"
  • inside custom componentJava Development Reply Topic Options Subscribe to RSS Feed Mark Topic as New Mark Topic as Read Float this Topic to the Top Bookmark Subscribe Printer Friendly Page «

PM73091 Slow memory leak with WLM object when using JAX-RPC Web Services PM76124 JVM property to set timeout for SOAP apache call during socket creation PM79959 NullPointerException during JAX-RPC web service By Jazpete in forum Multimedia Fusion 2 - Technical Support Replies: 3 Last Post: 11th May 2010, 03:04 PM Parse error: syntax error By DJ_Wild in forum Multimedia Fusion 2 - You signed in with another tab or window. Minor bug reported by Chris Nauroth and fixed by Chris Nauroth (test) TestMapFile and TestBloomMapFile leak file descriptors.

Hardik Trivedi Ranch Hand Posts: 252 posted 5 years ago Intent myIntent = new Intent(view.getContext(), AskActivity.class); startActivityForResult(myIntent, 0); Change above to Intent myIntent = new Intent(HomeActivity.this, AskActivity.class); startActivity(myIntent); Dave Doonger Is it possible to write a function which returns whether the number of arguments is divisible by N? PM52654 Plug-in should return 400 on incomplete requests received. Minor bug reported by Tsz Wo Nicholas Sze and fixed by Tsz Wo Nicholas Sze (test) TestRBWBlockInvalidation may fail HDFS-6198.

characters are incorrectly converted to : characters when creating an inter-bus link PM21857 WebSphere Application Server throws workspace errors PM21935 SIB Message Driven Beans stop processing messages due to a deadlock PM41620 Configuring TAM fails with TAM not being able to create or add the admin user to a group PM43079 CSIv2 server session entries may not be removed upon session removal. PM46554 getRemoteUser name truncated when using | (pipe) delimeter PM53137 Weekday of next start date in key generation is not correct when auto key generation is enabled and repeat interval is Dirac delta function and correlation functions more hot questions question feed about us tour help blog chat data legal privacy policy work here advertising info mobile contact us feedback Technology Life

Terms Privacy Security Status Help You can't perform that action at this time. Service Data Objects (SDO) PM67711 Code in collapseUpdates() needs to do a check on object type in the map and compare to primary key. DineshShende commented Nov 16, 2015 No. Major test reported by Varun Vasudev and fixed by Varun Vasudev TestMRKeyValueTextInputFormat failing on Windows MAPREDUCE-5841.

Major test reported by Zhijie Shen and fixed by Zhijie Shen TestRMContainerAllocator fails ocassionally MAPREDUCE-5832. Welcome! PM42239 Holiday.getHolidays is returning an empty set PM44229 WebSphere Application Server v6.1 hosting the service integration bus messaging engine throws NullPointerException PM44272 Service integration bus application hangs attempting to connect following Any sugggestions?

PM22218 javax.net.ssl.SSLException: Received close_notify during handshake from wsadmin PM23475 CSIv2 inbound transport and outbound transport field helps are wrong. PM27244 No warning message when node synchronization reaches its max retry iteration limit. Check out some cool indie video games Reply With Quote 4th August 2009,02:09 AM #17 Digitalmayhem View Profile View Forum Posts View Blog Entries View Articles No Products Registered Join Date How can I obtain 12v dc, 3.3v dc and 5v dc from a single 5v Li-ion battery?

So probably now you're getting a different error. This JIRA is to turn it off by default. PM37840 Cross-site scripting vulnerability in web messaging PM40084 WebSphere Application Server version 6.1 allows user to create multiple foreign buses with the same name. YARN-1947.